BDBM50221721 CHEMBL419443
SMILES OC(=O)[C@@H]1[C@@H](CC2CCNCC2)C(=O)N1C(=O)N1CCN(CC1)C(=O)c1ccc2ccccc2c1
InChI Key InChIKey=RBHHDABLJIJQAW-YADHBBJMSA-N
Data  1 IC50
  Tab Delimited (TSV)   2D SDfile   Computed 3D by Vconf -m prep SDfile
Find this compound or compounds like it in BindingDB:
Activity Spreadsheet -- Enzyme Inhibition Constant Data from BindingDB
Found 1 hit for monomerid = 50221721
TargetTryptase beta-2/delta/gamma(Homo sapiens (Human))
The Bristol-Myers Squibb Pharmaceutical Research Institute
Curated by ChEMBL
LigandPNGBDBM50221721(CHEMBL419443)
Affinity DataIC50:  30nM. Assay description: Inhibitory activity against human tryptase
In DepthDetails ArticlePubMed