BDBM50221723 CHEMBL306488
SMILES OC(=O)[C@@H]1[C@@H](CC2CCNCC2)C(=O)N1C(=O)N1CCN(CC1)C(=O)c1cc2ccccc2o1
InChI Key InChIKey=HMLANHPVUFCJDC-XLIONFOSSA-N
Data  1 IC50
  Tab Delimited (TSV)   2D SDfile   Computed 3D by Vconf -m prep SDfile
Find this compound or compounds like it in BindingDB:
Activity Spreadsheet -- Enzyme Inhibition Constant Data from BindingDB
Found 1 hit for monomerid = 50221723
TargetTryptase beta-2/delta/gamma(Homo sapiens (Human))
The Bristol-Myers Squibb Pharmaceutical Research Institute
Curated by ChEMBL
LigandPNGBDBM50221723(CHEMBL306488)
Affinity DataIC50:  21nM. Assay description: Inhibitory activity against human tryptase
In DepthDetails ArticlePubMed