BDBM50223088 4-(4-(3-chloro-4-fluorophenylamino)quinazolin-6-yl)but-3-yn-1-ol::CHEMBL249921
SMILES OCCC#Cc1ccc2ncnc(Nc3ccc(F)c(Cl)c3)c2c1
InChI Key InChIKey=WZAHNIGELIOSPL-UHFFFAOYSA-N
Data  1 IC50
  Tab Delimited (TSV)   2D SDfile   Computed 3D by Vconf -m prep SDfile
Find this compound or compounds like it in BindingDB:
Activity Spreadsheet -- Enzyme Inhibition Constant Data from BindingDB
Found 1 hit for monomerid = 50223088
TargetEpidermal growth factor receptor(Homo sapiens (Human))
Development Center For Biotechnology
Curated by ChEMBL
LigandPNGBDBM50223088(4-(4-(3-chloro-4-fluorophenylamino)quinazolin-6-yl...)
Affinity DataIC50:  186nM. Assay description: Inhibition of EGFR
In DepthDetails ArticlePubMed