BDBM50223090 3-(4-(3-chloro-4-fluorophenylamino)quinazolin-6-yl)prop-2-yn-1-ol::CHEMBL249919
SMILES OCC#Cc1ccc2ncnc(Nc3ccc(F)c(Cl)c3)c2c1
InChI Key InChIKey=RWLVCMCVCFJFDU-UHFFFAOYSA-N
Data  1 IC50
  Tab Delimited (TSV)   2D SDfile   Computed 3D by Vconf -m prep SDfile
Find this compound or compounds like it in BindingDB:
Activity Spreadsheet -- Enzyme Inhibition Constant Data from BindingDB
Found 1 hit for monomerid = 50223090
TargetEpidermal growth factor receptor(Homo sapiens (Human))
Development Center For Biotechnology
Curated by ChEMBL
LigandPNGBDBM50223090(3-(4-(3-chloro-4-fluorophenylamino)quinazolin-6-yl...)
Affinity DataIC50:  14nM. Assay description: Inhibition of EGFR
In DepthDetails ArticlePubMed