BDBM50223129 CHEMBL30379
SMILES CCCCc1nc(NCc2ccccc2)c2sccc2n1
InChI Key InChIKey=DVDMKLDPYXVOQQ-UHFFFAOYSA-N
Data  4 IC50  1 EC50
  Tab Delimited (TSV)   2D SDfile   Computed 3D by Vconf -m prep SDfile
Find this compound or compounds like it in BindingDB:
Activity Spreadsheet -- Enzyme Inhibition Constant Data from BindingDB
Found 5 hits for monomerid = 50223129
TargetcAMP-specific 3',5'-cyclic phosphodiesterase 4A/4B/4C/4D(Homo sapiens (Human))
National Institute Of Pharmaceutical Education And Research (Niper)
Curated by ChEMBL
LigandPNGBDBM50223129(CHEMBL30379)
Affinity DataIC50:  900nM. Assay description: Inhibitory activity against (PDE IV) phosphodiesterase IV in guinea pig articular tissue
In DepthDetails ArticlePubMed
TargetcAMP-specific 3',5'-cyclic phosphodiesterase 4C(Rattus norvegicus)
RhôNe-Poulenc Rorer
Curated by ChEMBL
LigandPNGBDBM50223129(CHEMBL30379)
Affinity DataIC50:  230nM. Assay description: Affinity for the high affinity rolipram binding site of phosphodiesterase (PDE IV) by [3H]rolipram displacement.
In DepthDetails ArticlePubMed
TargetcAMP-specific 3',5'-cyclic phosphodiesterase 4A/4B/4C/4D(Homo sapiens (Human))
National Institute Of Pharmaceutical Education And Research (Niper)
Curated by ChEMBL
LigandPNGBDBM50223129(CHEMBL30379)
Affinity DataEC50:  1.80E+3nM. Assay description: Increased cAMP accumulation in isoprenaline-induced guinea pig eosinophils
In DepthDetails ArticlePubMed
TargetcGMP-inhibited 3',5'-cyclic phosphodiesterase 3A/3B(Homo sapiens (Human))
RhôNe-Poulenc Rorer
Curated by ChEMBL
LigandPNGBDBM50223129(CHEMBL30379)
Affinity DataIC50:  9.70E+4nM. Assay description: Inhibitory activity against cGMP inhibited Phosphodiesterase 3, isolated from guinea pig ventricular tissue
In DepthDetails ArticlePubMed
TargetcAMP-specific 3',5'-cyclic phosphodiesterase 4A/4B/4C/4D(Homo sapiens (Human))
National Institute Of Pharmaceutical Education And Research (Niper)
Curated by ChEMBL
LigandPNGBDBM50223129(CHEMBL30379)
Affinity DataIC50:  900nM. Assay description: Inhibitory activity against phosphodiesterase 4 isolated from guinea pig ventricular tissue
In DepthDetails ArticlePubMed