BDBM50223644 CHEMBL366732
SMILES CN(C)CC1CN2c3ccccc3Sc3cccc(C1)c23
InChI Key InChIKey=FISKMTGUXLEBAZ-UHFFFAOYSA-N
Data  1 IC50
  Tab Delimited (TSV)   2D SDfile   Computed 3D by Vconf -m prep SDfile
Find this compound or compounds like it in BindingDB:
Activity Spreadsheet -- Enzyme Inhibition Constant Data from BindingDB
Found 1 hit for monomerid = 50223644
TargetD(1A)/D(2) dopamine receptor(BOVINE)
TBA
Curated by ChEMBL
LigandPNGBDBM50223644(CHEMBL366732)
Affinity DataIC50:  0.00140nM. Assay description: Compound was tested for its ability to displace [3H]spiroperidol from dopamine receptor
In DepthDetails ArticlePubMed