BDBM50223879 CHEMBL280688
SMILES CN1CCC23CCCCC2C1Cc1ccc(OC(C)(C)C)cc31
InChI Key InChIKey=HWTLPRHSBYNYIX-UHFFFAOYSA-N
Data  1 IC50
  Tab Delimited (TSV)   2D SDfile   Computed 3D by Vconf -m prep SDfile
Find this compound or compounds like it in BindingDB:
Activity Spreadsheet -- Enzyme Inhibition Constant Data from BindingDB
Found 1 hit for monomerid = 50223879
LigandPNGBDBM50223879(CHEMBL280688)
Affinity DataIC50:  3.00E+3nM. Assay description: Concentration required to inhibit [3H]naltrexone binding to Opioid receptors
In DepthDetails ArticlePubMed