BDBM50224367 1-(2-chloro-2-phenylethyl)-N-(2-chlorophenethyl)-6-(methylthio)-1H-pyrazolo[3,4-d]pyrimidin-4-amine::CHEMBL235757::N-(2-chlorophenethyl)-1-(2-chloro-2-phenylethyl)-6-(methylthio)-1H-pyrazolo[3,4-d]pyrimidin-4-amine
SMILES CSc1nc(NCCc2ccccc2Cl)c2cnn(CC(Cl)c3ccccc3)c2n1
InChI Key InChIKey=KJWCAGAIQICXKK-UHFFFAOYSA-N
Data  3 KI
  Tab Delimited (TSV)   2D SDfile   Computed 3D by Vconf -m prep SDfile
Find this compound or compounds like it in BindingDB:
Activity Spreadsheet -- Enzyme Inhibition Constant Data from BindingDB
Found 3 hits for monomerid = 50224367
TargetTyrosine-protein kinase ABL1(Homo sapiens (Human))
Universit£
Curated by ChEMBL
LigandPNGBDBM50224367(1-(2-chloro-2-phenylethyl)-N-(2-chlorophenethyl)-6...)
Affinity DataKi:  320nM. Assay description: Inhibition of human recombinant Abl
In DepthDetails ArticlePubMed
TargetProto-oncogene tyrosine-protein kinase Src(Homo sapiens (Human))
Universit£
Curated by ChEMBL
LigandPNGBDBM50224367(1-(2-chloro-2-phenylethyl)-N-(2-chlorophenethyl)-6...)
Affinity DataKi:  4.00E+3nM. Assay description: Inhibition of human recombinant Src
In DepthDetails ArticlePubMed
TargetProto-oncogene tyrosine-protein kinase Src(Homo sapiens (Human))
Universit£
Curated by ChEMBL
LigandPNGBDBM50224367(1-(2-chloro-2-phenylethyl)-N-(2-chlorophenethyl)-6...)
Affinity DataKi:  4.00E+3nM. Assay description: Inhibition of human recombinant Src
In DepthDetails ArticlePubMed