BDBM50224515 (E)-2-(4-(1H-indol-3-yl)piperidin-1-yl)-2-(1-cinnamoylpiperidin-4-yl)acetic acid::CHEMBL236721
SMILES OC(=O)C(C1CCN(CC1)C(=O)\C=C\c1ccccc1)N1CCC(CC1)c1c[nH]c2ccccc12
InChI Key InChIKey=BIOQWEAWVQXRRD-ZHACJKMWSA-N
Data  1 IC50
  Tab Delimited (TSV)   2D SDfile   Computed 3D by Vconf -m prep SDfile
Find this compound or compounds like it in BindingDB:
Activity Spreadsheet -- Enzyme Inhibition Constant Data from BindingDB
Found 1 hit for monomerid = 50224515
TargetC-C chemokine receptor type 2(Homo sapiens (Human))
Johnson & Johnson Pharmaceutical Research And Development
Curated by ChEMBL
LigandPNGBDBM50224515((E)-2-(4-(1H-indol-3-yl)piperidin-1-yl)-2-(1-cinna...)
Affinity DataIC50:  80nM. Assay description: Inhibition of human CCR2
In DepthDetails ArticlePubMed