BDBM50224561 CHEMBL605655
SMILES CCCNc1ncnc2n(ncc12)C1O[C@H](CO)[C@@H](O)[C@H]1O
InChI Key InChIKey=XUMLTIJAOXDPSU-PNFNOFIGSA-N
Data  1 IC50
  Tab Delimited (TSV)   2D SDfile   Computed 3D by Vconf -m prep SDfile
Find this compound or compounds like it in BindingDB:
Activity Spreadsheet -- Enzyme Inhibition Constant Data from BindingDB
Found 1 hit for monomerid = 50224561
TargetAdenosine receptor A1/A2a/A2b/A3(Rattus norvegicus (rat))
TBA
Curated by ChEMBL
LigandPNGBDBM50224561(CHEMBL605655)
Affinity DataIC50:  7.65E+4nM. Assay description: Displacement of [3H]CHA from rat brain adenosine receptor
In DepthDetails ArticlePubMed