BDBM50224638 CHEMBL64084
SMILES Cc1ccccc1N1CCN(CCCCN2C(=O)CC3(CCCC3)CC2=O)CC1
InChI Key InChIKey=WGZHEOCPGHYCAZ-UHFFFAOYSA-N
Data  2 IC50
  Tab Delimited (TSV)   2D SDfile   Computed 3D by Vconf -m prep SDfile
Find this compound or compounds like it in BindingDB:
Activity Spreadsheet -- Enzyme Inhibition Constant Data from BindingDB
Found 2 hits for monomerid = 50224638
TargetAlpha-1A/Alpha-1B/Alpha-1D adrenergic receptor(Rattus norvegicus (rat))
TBA
Curated by ChEMBL
LigandPNGBDBM50224638(CHEMBL64084)
Affinity DataIC50:  44nM. Assay description: Inhibition of [3H]WB-4101 binding to alpha-1-adrenergic receptor from rat cerebral cortex membranes
In DepthDetails ArticlePubMed
TargetD(1A)/D(1B)/D(2)/D(3)/D(4) dopamine receptor(Rattus norvegicus (rat))
TBA
Curated by ChEMBL
LigandPNGBDBM50224638(CHEMBL64084)
Affinity DataIC50:  390nM. Assay description: Inhibition of [3H]spiperone binding to dopamine receptor from rat corpus striatal membranes
In DepthDetails ArticlePubMed