BDBM50225107 CHEMBL49914
SMILES CCCc1c(O)c(ccc1OCCCOc1ccc2ccc(OCC(O)=O)cc2c1C(C)=O)C(C)=O
InChI Key InChIKey=HNPGZXUDAMBXBD-UHFFFAOYSA-N
Data  1 IC50
  Tab Delimited (TSV)   2D SDfile   Computed 3D by Vconf -m prep SDfile
Find this compound or compounds like it in BindingDB:
Activity Spreadsheet -- Enzyme Inhibition Constant Data from BindingDB
Found 1 hit for monomerid = 50225107
TargetCysteinyl leukotriene receptor 1/2(Homo sapiens (Human))
TBA
Curated by ChEMBL
LigandPNGBDBM50225107(CHEMBL49914)
Affinity DataIC50:  200nM. Assay description: In vitro inhibition of SRS-A-induced contractions in guinea pig ileum
In DepthDetails ArticlePubMed