BDBM50225142 (E)-1-(3-methyl-1,4-dioxy-quinoxalin-2-yl)-3-(3,4,5-trimethoxy-phenyl)-propenone::3-Methyl-2-[3-(3,4,5-trimethoxyphenyl)-2-propenoyl]-quinoxaline-1,4-dioxide::CHEMBL237950
SMILES COc1cc(\C=C\C(=O)c2c(C)[n+]([O-])c3ccccc3[n+]2[O-])cc(OC)c1OC
InChI Key InChIKey=CFNHGTLEPYTDDJ-MDZDMXLPSA-N
Data  1 IC50
  Tab Delimited (TSV)   2D SDfile   Computed 3D by Vconf -m prep SDfile
Find this compound or compounds like it in BindingDB:
Activity Spreadsheet -- Enzyme Inhibition Constant Data from BindingDB
Found 1 hit for monomerid = 50225142
TargetSeed linoleate 13S-lipoxygenase-1(Glycine max (soybean))
Universidad De Navarra
Curated by ChEMBL
LigandPNGBDBM50225142((E)-1-(3-methyl-1,4-dioxy-quinoxalin-2-yl)-3-(3,4,...)
Affinity DataIC50:  4.20E+4nM. Assay description: Inhibition of soybean lipoxygenase
In DepthDetails ArticlePubMed