BDBM50225196 CHEMBL432127
SMILES CCCc1c(O)c(ccc1OCCCOc1ccc2ccc(OCCCC(O)=O)cc2c1)C(C)=O
InChI Key InChIKey=HBNWXKBIDMJOED-UHFFFAOYSA-N
Data  1 IC50
  Tab Delimited (TSV)   2D SDfile   Computed 3D by Vconf -m prep SDfile
Find this compound or compounds like it in BindingDB:
Activity Spreadsheet -- Enzyme Inhibition Constant Data from BindingDB
Found 1 hit for monomerid = 50225196
TargetCysteinyl leukotriene receptor 1/2(Homo sapiens (Human))
TBA
Curated by ChEMBL
LigandPNGBDBM50225196(CHEMBL432127)
Affinity DataIC50:  5.00E+3nM. Assay description: In vitro inhibition of SRS-A-induced contractions in guinea pig ileum
In DepthDetails ArticlePubMed