BDBM50225214 CHEMBL606769
SMILES [H][C@]12Cc3ccccc3[C@@]3(CCN1C)CC(=O)CC[C@@]23O
InChI Key InChIKey=VSIVJZKTOMWULO-BRWVUGGUSA-N
Data  2 IC50
  Tab Delimited (TSV)   2D SDfile   Computed 3D by Vconf -m prep SDfile
Find this compound or compounds like it in BindingDB:
Activity Spreadsheet -- Enzyme Inhibition Constant Data from BindingDB
Found 2 hits for monomerid = 50225214
LigandPNGBDBM50225214(CHEMBL606769)
Affinity DataIC50:  12nM. Assay description: Concentration for 50% inhibition of [3H]naloxone (1 M) binding to opioid receptor in rat brain membrane was determined in the presence of NaCl
In DepthDetails ArticlePubMed
LigandPNGBDBM50225214(CHEMBL606769)
Affinity DataIC50:  0.300nM. Assay description: Concentration for 50% inhibition of [3H]naloxone (1 M) binding to opioid receptor in rat brain membrane was determined in the absence of NaCl
In DepthDetails ArticlePubMed