BDBM50225317 CHEMBL45542
SMILES CCN(CC)c1nc(NCC(O)c2cccc(O)c2)nc2cc(OC)c(OC)cc12
InChI Key InChIKey=AMGOOKOYDBKYJQ-UHFFFAOYSA-N
Data  1 IC50
  Tab Delimited (TSV)   2D SDfile   Computed 3D by Vconf -m prep SDfile
Find this compound or compounds like it in BindingDB:
Activity Spreadsheet -- Enzyme Inhibition Constant Data from BindingDB
Found 1 hit for monomerid = 50225317
TargetcAMP-specific 3',5'-cyclic phosphodiesterase 4A/4B/4C/4D(Homo sapiens (Human))
TBA
Curated by ChEMBL
LigandPNGBDBM50225317(CHEMBL45542)
Affinity DataIC50:  2.95E+5nM. Assay description: Inhibition of bovine heart cAMP-phosphodiesterase
In DepthDetails ArticlePubMed