BDBM50225847 CHEMBL54820
SMILES CCCOC(=O)\C=C\C(=O)N[C@@H]1CC[C@@]2(O)C3Cc4ccc(O)c5OC1C2(CCN3CC1CC1)c45
InChI Key InChIKey=VSKUDKZDADPATC-NCQVEBNESA-N
Data  2 IC50
  Tab Delimited (TSV)   2D SDfile   Computed 3D by Vconf -m prep SDfile
Find this compound or compounds like it in BindingDB:
Activity Spreadsheet -- Enzyme Inhibition Constant Data from BindingDB
Found 2 hits for monomerid = 50225847
LigandPNGBDBM50225847(CHEMBL54820)
Affinity DataIC50:  21nM. Assay description: Compound was tested for agonist activity against opioid receptor in mouse vas deferens preparation
In DepthDetails ArticlePubMed
LigandPNGBDBM50225847(CHEMBL54820)
Affinity DataIC50:  1.60nM. Assay description: The compound was tested for binding affinity against opioid receptor in rat brain membranes, using [3H]dihydromorphine as the radioligand
In DepthDetails ArticlePubMed