BDBM502261 2-(S)- hydroxy-N- [4-(6- methoxy- 1,7- dimethyl- [1,2,4]triazolo [4,3-a] quinoxaline-4- ylamino)- butyl]-3- methyl- butyramide::US11028090, Example 137
SMILES COc1c(C)ccc2c1nc(NCCCCNC(=O)[C@@H](O)C(C)C)c1nnc(C)n21
InChI Key InChIKey=NLVPMDXJLFNJNV-KRWDZBQOSA-N
Data  1 IC50
  Tab Delimited (TSV)   2D SDfile   Computed 3D by Vconf -m prep SDfile
Find this compound or compounds like it in BindingDB:
Activity Spreadsheet -- Enzyme Inhibition Constant Data from BindingDB
Found 1 hit for monomerid = 502261
TargetBromodomain-containing protein 4(Homo sapiens (Human))
Dong Wha Pharm.
US Patent
LigandPNGBDBM502261(2-(S)- hydroxy-N- [4-(6- methoxy- 1,7- dimethyl- [...)
Affinity DataIC50:  6nM. Assay description: The following experiment was performed to evaluate the ability of [1,2,4]triazolo[4,3-a]quinoxaline derivative of the present invention to inhibit th...
Ligand InfoPC cidPC sid
In DepthDetails US Patent