BDBM50226485 (R)-3-(3-fluoro-4-(tetrahydro-2H-pyran-4-yl)phenyl)-2-oxooxazolidine-5-carboxamide::CHEMBL235373
SMILES NC(=O)[C@H]1CN(C(=O)O1)c1ccc(C2CCOCC2)c(F)c1
InChI Key InChIKey=RYZIGHGVLLKQPY-CYBMUJFWSA-N
Data  1 KI
  Tab Delimited (TSV)   2D SDfile   Computed 3D by Vconf -m prep SDfile
Find this compound or compounds like it in BindingDB:
Activity Spreadsheet -- Enzyme Inhibition Constant Data from BindingDB
Found 1 hit for monomerid = 50226485
TargetAmine oxidase [flavin-containing] A(Homo sapiens (Human))
Pfizer
Curated by ChEMBL
LigandPNGBDBM50226485((R)-3-(3-fluoro-4-(tetrahydro-2H-pyran-4-yl)phenyl...)
Affinity DataKi:  5.80E+4nM. Assay description: Inhibition of human recombinant MAOA
In DepthDetails ArticlePubMed