BDBM50226501 (2R,6R)-1-(4-chlorophenylsulfonyl)-2-ethyl-6-(1-((3-methyl-1,2,4-oxadiazol-5-yl)methyl)cyclopropyl)piperidine::CHEMBL252616
SMILES CC[C@@H]1CCC[C@@H](N1S(=O)(=O)c1ccc(Cl)cc1)C1(Cc2nc(C)no2)CC1
InChI Key InChIKey=PGCKAECGLQMGNP-SJLPKXTDSA-N
Data  1 IC50
  Tab Delimited (TSV)   2D SDfile   Computed 3D by Vconf -m prep SDfile
Find this compound or compounds like it in BindingDB:
Activity Spreadsheet -- Enzyme Inhibition Constant Data from BindingDB
Found 1 hit for monomerid = 50226501
TargetCytochrome P450 3A4(Homo sapiens (Human))
Schering-Plough Research Institute
Curated by ChEMBL
LigandPNGBDBM50226501((2R,6R)-1-(4-chlorophenylsulfonyl)-2-ethyl-6-(1-((...)
Affinity DataIC50: >3.00E+4nM. Assay description: Inhibition of CYP3A4 preincubated before 30 mins
In DepthDetails ArticlePubMed