BDBM50227515 2-methyl-4,5,6,7-tetrahydrothieno[3,2-c]pyridine::CHEMBL399179
SMILES Cc1cc2CNCCc2s1
InChI Key InChIKey=PTLTZFJYSSVFEC-UHFFFAOYSA-N
Data  1 KI
  Tab Delimited (TSV)   2D SDfile   Computed 3D by Vconf -m prep SDfile
Find this compound or compounds like it in BindingDB:
Activity Spreadsheet -- Enzyme Inhibition Constant Data from BindingDB
Found 1 hit for monomerid = 50227515
TargetPhenylethanolamine N-methyltransferase(Homo sapiens (Human))
The University Of Kansas
Curated by ChEMBL
LigandPNGBDBM50227515(2-methyl-4,5,6,7-tetrahydrothieno[3,2-c]pyridine |...)
Affinity DataKi:  2.50E+4nM. Assay description: Inhibition of human PNMT by radiochemical assay
In DepthDetails ArticlePubMed