BDBM50227813 CHEMBL293974
SMILES CC(C)(C)NCC(O)COc1ccc2c(c1)oc(cc2=O)-c1ccccc1
InChI Key InChIKey=WANOPVSNXUMHSM-UHFFFAOYSA-N
Data  1 KI
  Tab Delimited (TSV)   2D SDfile   Computed 3D by Vconf -m prep SDfile
Find this compound or compounds like it in BindingDB:
Activity Spreadsheet -- Enzyme Inhibition Constant Data from BindingDB
Found 1 hit for monomerid = 50227813
TargetBeta-1/Beta-2/Beta-3 adrenergic receptor(Rattus norvegicus (Rat))
Pennwalt
Curated by ChEMBL
LigandPNGBDBM50227813(CHEMBL293974)
Affinity DataKi:  1.80E+4nM. Assay description: Inhibition constant from beta adrenergic receptor binding assay
In DepthDetails ArticlePubMed