BDBM50227894 CHEMBL6340
SMILES COc1cc2nc(nc(N)c2cc1OC)N1CCN(CC1)C(=O)\C=C\C=C\C
InChI Key InChIKey=IGAQSPGTMPOCMT-YTXTXJHMSA-N
Data  1 IC50
  Tab Delimited (TSV)   2D SDfile   Computed 3D by Vconf -m prep SDfile
Find this compound or compounds like it in BindingDB:
Activity Spreadsheet -- Enzyme Inhibition Constant Data from BindingDB
Found 1 hit for monomerid = 50227894
TargetAlpha-1A/Alpha-1B/Alpha-1D adrenergic receptor(Rattus norvegicus (rat))
National Institute On Aging/Grc
Curated by ChEMBL
LigandPNGBDBM50227894(CHEMBL6340)
Affinity DataIC50:  4.40nM. Assay description: Displacement of [3H]prazosin binding to Alpha-1 adrenergic receptor sites on rat cerebral cortical membranes at 100 nM concentration
In DepthDetails ArticlePubMed