BDBM50228015 CHEMBL253065::N-{1-((R)-5-methyl-4,5-dihydro-1H-imidazol-2-yl)-2-[4-(1,1,3-trioxo-1lambda6-isothiazolidin-5-yl)-phenyl]-ethyl}-3-trifluoromethyl-benzenesulfonamide
SMILES C[C@@H]1CN=C(N1)C(Cc1ccc(cc1)C1CC(=O)NS1(=O)=O)NS(=O)(=O)c1cccc(c1)C(F)(F)F
InChI Key InChIKey=IKHWPFMJQXXYAP-XYJCDUHRSA-N
Data  2 IC50
  Tab Delimited (TSV)   2D SDfile   Computed 3D by Vconf -m prep SDfile
Find this compound or compounds like it in BindingDB:
Activity Spreadsheet -- Enzyme Inhibition Constant Data from BindingDB
Found 2 hits for monomerid = 50228015
TargetTyrosine-protein phosphatase non-receptor type 2(Homo sapiens (Human))
Incyte
Curated by ChEMBL
LigandPNGBDBM50228015(CHEMBL253065 | N-{1-((R)-5-methyl-4,5-dihydro-1H-i...)
Affinity DataIC50:  420nM. Assay description: Inhibition of TCPTP by pNPP assay
In DepthDetails ArticlePubMed
TargetTyrosine-protein phosphatase non-receptor type 1(Homo sapiens (Human))
Incyte
Curated by ChEMBL
LigandPNGBDBM50228015(CHEMBL253065 | N-{1-((R)-5-methyl-4,5-dihydro-1H-i...)
Affinity DataIC50:  540nM. Assay description: Inhibition of PTP1B by pNPP assay
In DepthDetails ArticlePubMed