BDBM50228026 2-[4-(2-{1-(3-fluoro-benzenesulfonylamino)-2-[3-methyl-4-(1,1,3-trioxo-1lambda6-isothiazolidin-5-yl)-phenyl]-ethyl}-3H-imidazol-4-yl)-butoxy]-6-hydroxy-benzoic acid methyl ester::CHEMBL274743
SMILES COC(=O)c1c(O)cccc1OCCCCc1cnc([nH]1)C(Cc1ccc(C2CC(=O)NS2(=O)=O)c(C)c1)NS(=O)(=O)c1cccc(F)c1
InChI Key InChIKey=ZYYILCFZQNKLOI-UHFFFAOYSA-N
Data  2 IC50
  Tab Delimited (TSV)   2D SDfile   Computed 3D by Vconf -m prep SDfile
Find this compound or compounds like it in BindingDB:
Activity Spreadsheet -- Enzyme Inhibition Constant Data from BindingDB
Found 2 hits for monomerid = 50228026
TargetTyrosine-protein phosphatase non-receptor type 1(Homo sapiens (Human))
Incyte
Curated by ChEMBL
LigandPNGBDBM50228026(2-[4-(2-{1-(3-fluoro-benzenesulfonylamino)-2-[3-me...)
Affinity DataIC50:  160nM. Assay description: Inhibition of PTP1B by pNPP assay
In DepthDetails ArticlePubMed
TargetTyrosine-protein phosphatase non-receptor type 2(Homo sapiens (Human))
Incyte
Curated by ChEMBL
LigandPNGBDBM50228026(2-[4-(2-{1-(3-fluoro-benzenesulfonylamino)-2-[3-me...)
Affinity DataIC50:  170nM. Assay description: Inhibition of TCPTP by pNPP assay
In DepthDetails ArticlePubMed