BDBM50228034 CHEMBL403680::N-{1-(5-phenethyl-1H-imidazol-2-yl)-2-[4-(1,1,3-trioxo-1lambda6-isothiazolidin-5-yl)-phenyl]-ethyl}-3-trifluoromethyl-benzenesulfonamide
SMILES FC(F)(F)c1cccc(c1)S(=O)(=O)NC(Cc1ccc(cc1)C1CC(=O)NS1(=O)=O)c1ncc(CCc2ccccc2)[nH]1
InChI Key InChIKey=OACZRTSAVJISLU-UHFFFAOYSA-N
Data  2 IC50
  Tab Delimited (TSV)   2D SDfile   Computed 3D by Vconf -m prep SDfile
Find this compound or compounds like it in BindingDB:
Activity Spreadsheet -- Enzyme Inhibition Constant Data from BindingDB
Found 2 hits for monomerid = 50228034
TargetTyrosine-protein phosphatase non-receptor type 2(Homo sapiens (Human))
Incyte
Curated by ChEMBL
LigandPNGBDBM50228034(CHEMBL403680 | N-{1-(5-phenethyl-1H-imidazol-2-yl)...)
Affinity DataIC50:  170nM. Assay description: Inhibition of TCPTP by pNPP assay
In DepthDetails ArticlePubMed
TargetTyrosine-protein phosphatase non-receptor type 1(Homo sapiens (Human))
Incyte
Curated by ChEMBL
LigandPNGBDBM50228034(CHEMBL403680 | N-{1-(5-phenethyl-1H-imidazol-2-yl)...)
Affinity DataIC50:  170nM. Assay description: Inhibition of PTP1B by pNPP assay
In DepthDetails ArticlePubMed