BDBM50228508 CHEMBL329753
SMILES CC(CCc1nnn[nH]1)Cc1cccc(OCc2ccc3ccccc3n2)c1
InChI Key InChIKey=GABZVHZCIWHURT-UHFFFAOYSA-N
Data  1 KI
  Tab Delimited (TSV)   2D SDfile   Computed 3D by Vconf -m prep SDfile
Find this compound or compounds like it in BindingDB:
Activity Spreadsheet -- Enzyme Inhibition Constant Data from BindingDB
Found 1 hit for monomerid = 50228508
TargetCysteinyl leukotriene receptor 1/2(Homo sapiens (Human))
Rorer Central Research
Curated by ChEMBL
LigandPNGBDBM50228508(CHEMBL329753)
Affinity DataKi:  34nM. Assay description: In vitro binding affinity against cysteinyl leukotriene D4 receptor from guinea pig lung membrane
In DepthDetails ArticlePubMed