BDBM50229147 CHEMBL348793
SMILES [H][C@]12CCCN([C@]1([H])C[C@]1([H])N(CCc3cc4OCOc4cc13)C2)S(C)(=O)=O
InChI Key InChIKey=KKFYOXXHUIRLJK-BMFZPTHFSA-N
Data  2 KI
  Tab Delimited (TSV)   2D SDfile   Computed 3D by Vconf -m prep SDfile
Find this compound or compounds like it in BindingDB:
Activity Spreadsheet -- Enzyme Inhibition Constant Data from BindingDB
Found 2 hits for monomerid = 50229147
LigandPNGBDBM50229147(CHEMBL348793)
Affinity DataKi:  0.646nM. Assay description: Binding affinity to alpha-2 adrenergic receptor determined by measurement of [3H]yohimbine displacement from rat cortical membrane
In DepthDetails ArticlePubMed
TargetAlpha-1A/Alpha-1B/Alpha-1D adrenergic receptor(Rattus norvegicus (rat))
Syntex Research
Curated by ChEMBL
LigandPNGBDBM50229147(CHEMBL348793)
Affinity DataKi:  4.79E+3nM. Assay description: Binding affinity to alpha-1 adrenergic receptor determined by measurement of [3H]prazosin displacement from rat cortical membrane
In DepthDetails ArticlePubMed