BDBM50229835 CHEMBL90857
SMILES NS(=O)(=O)c1nnc(NC(=O)CCCCC(O)=O)s1
InChI Key InChIKey=MEEQHWQTWYNUGS-UHFFFAOYSA-N
Data  1 IC50
  Tab Delimited (TSV)   2D SDfile   Computed 3D by Vconf -m prep SDfile
Find this compound or compounds like it in BindingDB:
Activity Spreadsheet -- Enzyme Inhibition Constant Data from BindingDB
Found 1 hit for monomerid = 50229835
TargetCarbonic anhydrase 1/12/13/14/2/3/4/5A, mitochondrial/5B, mitochondrial/6/7/9(Homo sapiens (Human))
Istituto Chimico Internazionale Dr. G. Rende
Curated by ChEMBL
LigandPNGBDBM50229835(CHEMBL90857)
Affinity DataIC50:  520nM. Assay description: Inhibition of Carbonic anhydrase enzyme in rabbits
In DepthDetails ArticlePubMed