BDBM50230894 CHEMBL72361
SMILES CCCc1nc(c(C#N)n1Cc1ccc(cc1)-c1ccccc1-c1nn[nH]n1)-n1cccc1C(O)=O
InChI Key InChIKey=UJAOIHCXPGYQKP-UHFFFAOYSA-N
Data  1 IC50
  Tab Delimited (TSV)   2D SDfile   Computed 3D by Vconf -m prep SDfile
Find this compound or compounds like it in BindingDB:
Activity Spreadsheet -- Enzyme Inhibition Constant Data from BindingDB
Found 1 hit for monomerid = 50230894
TargetType-1 angiotensin II receptor A/B(RAT)
Warner-Lambert
Curated by ChEMBL
LigandPNGBDBM50230894(CHEMBL72361)
Affinity DataIC50:  103nM. Assay description: Inhibitory concentration against binding of [125I]angiotensin II to rat liver expressing Angiotensin II receptor
In DepthDetails ArticlePubMed