BDBM50231228 CHEMBL96626
SMILES CCCCCN1CCC(CC1)(C(=O)CC)c1cccc(O)c1
InChI Key InChIKey=KTZOMBSUXDKHFC-UHFFFAOYSA-N
Data  1 IC50
  Tab Delimited (TSV)   2D SDfile   Computed 3D by Vconf -m prep SDfile
Find this compound or compounds like it in BindingDB:
Activity Spreadsheet -- Enzyme Inhibition Constant Data from BindingDB
Found 1 hit for monomerid = 50231228
LigandPNGBDBM50231228(CHEMBL96626)
Affinity DataIC50:  8.00E+3nM. Assay description: Displacement of radioligand [3H]-2-(di-N-propylamino)-8-hydroxytetralin from 5-hydroxytryptamine 1A receptor in rat frontal cortex homogenate (experi...
In DepthDetails ArticlePubMed