BDBM50231233 CHEMBL92960
SMILES CCCCCCN1CCC(CC1)(C(=O)OCC)c1ccccc1
InChI Key InChIKey=ICLNERWNGMYSLQ-UHFFFAOYSA-N
Data  1 IC50
  Tab Delimited (TSV)   2D SDfile   Computed 3D by Vconf -m prep SDfile
Find this compound or compounds like it in BindingDB:
Activity Spreadsheet -- Enzyme Inhibition Constant Data from BindingDB
Found 1 hit for monomerid = 50231233
LigandPNGBDBM50231233(CHEMBL92960)
Affinity DataIC50:  200nM. Assay description: Tested for displacement of radioligand [3H]-Naloxone from opiate receptor
In DepthDetails ArticlePubMed