BDBM50232182 CHEMBL4097327
SMILES CCC(CC)C(=O)Cc1c(nn2c(C)cc(C)nc12)-c1ccc(C)cc1
InChI Key InChIKey=SEHCFLABJOYWDO-UHFFFAOYSA-N
Data  2 KI
  Tab Delimited (TSV)   2D SDfile   Computed 3D by Vconf -m prep SDfile
Find this compound or compounds like it in BindingDB:
Activity Spreadsheet -- Enzyme Inhibition Constant Data from BindingDB
Found 2 hits for monomerid = 50232182
TargetTranslocator protein(Rattus norvegicus (rat))
University Of Kwazulu-Natal
Curated by ChEMBL
LigandPNGBDBM50232182(CHEMBL4097327)
Affinity DataKi:  0.800nM. Assay description: Displacement of [3H]PK11195 from PBZR in rat kidney mitochondrial membranes measured after 90 mins by liquid scintillation counting
In DepthDetails ArticlePubMed
TargetTranslocator protein(Rattus norvegicus (rat))
University Of Kwazulu-Natal
Curated by ChEMBL
LigandPNGBDBM50232182(CHEMBL4097327)
Affinity DataKi:  1.70nM. Assay description: Displacement of [3H]Ro5-4864 from PBZR in rat kidney mitochondrial membranes measured after 90 mins by liquid scintillation counting
In DepthDetails ArticlePubMed