BDBM50232757 CHEMBL4092412
SMILES CC(C)(C)NC[C@@H](O)COc1ccccc1-c1ccccc1
InChI Key InChIKey=DBHPVKNFKBKJCE-MRXNPFEDSA-N
Data  3 Kd
  Tab Delimited (TSV)   2D SDfile   Computed 3D by Vconf -m prep SDfile
Find this compound or compounds like it in BindingDB:
Activity Spreadsheet -- Enzyme Inhibition Constant Data from BindingDB
Found 3 hits for monomerid = 50232757
TargetBeta-2 adrenergic receptor(Homo sapiens (Human))
Philipps University Marburg
Curated by ChEMBL
LigandPNGBDBM50232757(CHEMBL4092412)
Affinity DataKd:  0.0355nM. Assay description: Displacement of [3H](-)CGP12177 from human beta2-AR expressed in CHOK1 cells after 2 hrs by TopCount microscintillation counting method
In DepthDetails ArticlePubMed
TargetBeta-2 adrenergic receptor(Homo sapiens (Human))
Philipps University Marburg
Curated by ChEMBL
LigandPNGBDBM50232757(CHEMBL4092412)
Affinity DataKd:  0.0182nM. Assay description: Partial agonist activity at human beta2-AR expressed in CHOK1 cells assessed as inhibition of cimaterol-induced CRE-SPAP production after 5 hrs
In DepthDetails ArticlePubMed
TargetBeta-1 adrenergic receptor(Homo sapiens (Human))
Philipps University Marburg
Curated by ChEMBL
LigandPNGBDBM50232757(CHEMBL4092412)
Affinity DataKd:  0.977nM. Assay description: Displacement of [3H](-)CGP12177 from human beta1-AR expressed in CHOK1 cells after 2 hrs by TopCount microscintillation counting method
In DepthDetails ArticlePubMed