BDBM50233562 3-(3,4-dioxo-2-(1-(4-(thiophen-3-yl)furan-2-yl)propylamino)cyclobut-1-enylamino)-2-hydroxy-N,N-dimethylbenzamide::CHEMBL253705
SMILES CCC(Nc1c(Nc2cccc(C(=O)N(C)C)c2O)c(=O)c1=O)c1cc(co1)-c1ccsc1
InChI Key InChIKey=KAVIMWXSTVLBFP-UHFFFAOYSA-N
Data  2 IC50
  Tab Delimited (TSV)   2D SDfile   Computed 3D by Vconf -m prep SDfile
Find this compound or compounds like it in BindingDB:
Activity Spreadsheet -- Enzyme Inhibition Constant Data from BindingDB
Found 2 hits for monomerid = 50233562
TargetC-X-C chemokine receptor type 2(Homo sapiens (Human))
Schering-Plough Research Institute
Curated by ChEMBL
LigandPNGBDBM50233562(3-(3,4-dioxo-2-(1-(4-(thiophen-3-yl)furan-2-yl)pro...)
Affinity DataIC50:  8.20nM. Assay description: Inhibition of CXCR2
In DepthDetails ArticlePubMed
TargetC-X-C chemokine receptor type 1(Homo sapiens (Human))
Schering-Plough Research Institute
Curated by ChEMBL
LigandPNGBDBM50233562(3-(3,4-dioxo-2-(1-(4-(thiophen-3-yl)furan-2-yl)pro...)
Affinity DataIC50:  221nM. Assay description: Inhibition of CXCR1
In DepthDetails ArticlePubMed