BDBM50233582 3-(3,4-dioxo-2-(1-(5-(3-(trifluoromethyl)phenyl)furan-2-yl)propylamino)cyclobut-1-enylamino)-2-hydroxy-N,N-dimethylbenzamide::CHEMBL251890
SMILES CCC(Nc1c(Nc2cccc(C(=O)N(C)C)c2O)c(=O)c1=O)c1ccc(o1)-c1cccc(c1)C(F)(F)F
InChI Key InChIKey=SOFYZCVOUACVKD-UHFFFAOYSA-N
Data  2 IC50
  Tab Delimited (TSV)   2D SDfile   Computed 3D by Vconf -m prep SDfile
Find this compound or compounds like it in BindingDB:
Activity Spreadsheet -- Enzyme Inhibition Constant Data from BindingDB
Found 2 hits for monomerid = 50233582
TargetC-X-C chemokine receptor type 1(Homo sapiens (Human))
Schering-Plough Research Institute
Curated by ChEMBL
LigandPNGBDBM50233582(3-(3,4-dioxo-2-(1-(5-(3-(trifluoromethyl)phenyl)fu...)
Affinity DataIC50:  3.43E+3nM. Assay description: Inhibition of CXCR1
In DepthDetails ArticlePubMed
TargetC-X-C chemokine receptor type 2(Homo sapiens (Human))
Schering-Plough Research Institute
Curated by ChEMBL
LigandPNGBDBM50233582(3-(3,4-dioxo-2-(1-(5-(3-(trifluoromethyl)phenyl)fu...)
Affinity DataIC50:  87nM. Assay description: Inhibition of CXCR2
In DepthDetails ArticlePubMed