BDBM50233778 CHEMBL251840::tert-butyl (R)-1-oxo-1-((3-((S)-1-phenylethyl)-3H-imidazo[4,5-b]pyridin-2-yl)methylamino)-3-(2-(trifluoromethyl)phenyl)propan-2-ylcarbamate
SMILES C[C@@H](c1ccccc1)n1c(CNC(=O)[C@@H](Cc2ccccc2C(F)(F)F)NC(=O)OC(C)(C)C)nc2cccnc12
InChI Key InChIKey=GCVRLFSAZVKLNE-YADARESESA-N
Data  1 IC50
  Tab Delimited (TSV)   2D SDfile   Computed 3D by Vconf -m prep SDfile
Find this compound or compounds like it in BindingDB:
Activity Spreadsheet -- Enzyme Inhibition Constant Data from BindingDB
Found 1 hit for monomerid = 50233778
TargetSodium channel protein type 9 subunit alpha(Homo sapiens (Human))
Merck Research Laboratories
Curated by ChEMBL
LigandPNGBDBM50233778(CHEMBL251840 | tert-butyl (R)-1-oxo-1-((3-((S)-1-p...)
Affinity DataIC50:  255nM. Assay description: Blockade of human Nav1.7 channel expressed in HEK293 cells by FRET assay
In DepthDetails ArticlePubMed