BDBM50233790 (R)-tert-butyl 1-oxo-1-((3-(2,2,3,3,3-pentafluoropropyl)-3H-imidazo[4,5-b]pyridin-2-yl)methylamino)-3-(2-(trifluoromethyl)phenyl)propan-2-ylcarbamate::CHEMBL252632
SMILES CC(C)(C)OC(=O)N[C@H](Cc1ccccc1C(F)(F)F)C(=O)NCc1nc2cccnc2n1CC(F)(F)C(F)(F)F
InChI Key InChIKey=FSDIGHDJKRVNHH-QGZVFWFLSA-N
Data  2 IC50
  Tab Delimited (TSV)   2D SDfile   Computed 3D by Vconf -m prep SDfile
Find this compound or compounds like it in BindingDB:
Activity Spreadsheet -- Enzyme Inhibition Constant Data from BindingDB
Found 2 hits for monomerid = 50233790
TargetSodium channel protein type 9 subunit alpha(Homo sapiens (Human))
Merck Research Laboratories
Curated by ChEMBL
LigandPNGBDBM50233790((R)-tert-butyl 1-oxo-1-((3-(2,2,3,3,3-pentafluorop...)
Affinity DataIC50:  123nM. Assay description: Blockade of human Nav1.7 channel expressed in HEK293 cells by FRET assay
In DepthDetails ArticlePubMed
TargetCytochrome P450 3A4(Homo sapiens (Human))
Merck Research Laboratories
Curated by ChEMBL
LigandPNGBDBM50233790((R)-tert-butyl 1-oxo-1-((3-(2,2,3,3,3-pentafluorop...)
Affinity DataIC50:  980nM. Assay description: Inhibition of CYP3A4
In DepthDetails ArticlePubMed