BDBM50234008 CHEMBL3261915
SMILES Cc1cc(O)c2C(=O)c3c(O)c(I)c(O)cc3C(=O)c2c1
InChI Key InChIKey=XWUIJWHWNCVUIJ-UHFFFAOYSA-N
Data  1 IC50
  Tab Delimited (TSV)   2D SDfile   Computed 3D by Vconf -m prep SDfile
Find this compound or compounds like it in BindingDB:
Activity Spreadsheet -- Enzyme Inhibition Constant Data from BindingDB
Found 1 hit for monomerid = 50234008
TargetATP-citrate synthase(Homo sapiens (Human))
Harvard Medical School
Curated by ChEMBL
LigandPNGBDBM50234008(CHEMBL3261915)
Affinity DataIC50:  7.50E+3nM. Assay description: Inhibition of ATP citrate lyase (unknown origin) using sodium citrate as substrate after 60 mins by ADP-Glo luminescence assay
In DepthDetails ArticlePubMed