BDBM502343 4-methyl- pentanoic acid-{4-[1- methyl-7- (1-methyl-1H- benzoimid- azole-2-yl)- [1,2,4]tri- azolo[4,3- a]quinoxaline- 4-ylamino]- butyl}-amide::US11028090, Example 236
SMILES CC(C)CCC(=O)NCCCCNc1nc2cc(ccc2n2c(C)nnc12)-c1nc2ccccc2n1C
InChI Key InChIKey=QFQYVESMVWXZQI-UHFFFAOYSA-N
Data  1 IC50
  Tab Delimited (TSV)   2D SDfile   Computed 3D by Vconf -m prep SDfile
Find this compound or compounds like it in BindingDB:
Activity Spreadsheet -- Enzyme Inhibition Constant Data from BindingDB
Found 1 hit for monomerid = 502343
TargetBromodomain-containing protein 4(Homo sapiens (Human))
Dong Wha Pharm.
US Patent
LigandPNGBDBM502343(4-methyl- pentanoic acid-{4-[1- methyl-7- (1-meth...)
Affinity DataIC50:  2nM. Assay description: The following experiment was performed to evaluate the ability of [1,2,4]triazolo[4,3-a]quinoxaline derivative of the present invention to inhibit th...
Ligand InfoPC cidPC sid
In DepthDetails US Patent