BDBM50235055 CHEMBL4095355
SMILES CCN(CC)C1CCC(C)(CC1)C(=O)Nc1nc2c(OC)ccc(N3CCOCC3)c2s1
InChI Key InChIKey=ICQXQZUVCBUGLO-UHFFFAOYSA-N
Data  7 KI
  Tab Delimited (TSV)   2D SDfile   Computed 3D by Vconf -m prep SDfile
Find this compound or compounds like it in BindingDB:
Activity Spreadsheet -- Enzyme Inhibition Constant Data from BindingDB
Found 7 hits for monomerid = 50235055
TargetAdenosine receptor A2a(Homo sapiens (Human))
Advinus Therapeutics
Curated by ChEMBL
LigandPNGBDBM50235055(CHEMBL4095355)
Affinity DataKi:  0.200nM. Assay description: Antagonist activity at human adenosine A2A receptor expressed in HEK293 cell membranes assessed as decrease in CGS-21680/forskolin-induced cAMP level...
In DepthDetails ArticlePubMed
TargetAdenosine receptor A2a(Homo sapiens (Human))
Advinus Therapeutics
Curated by ChEMBL
LigandPNGBDBM50235055(CHEMBL4095355)
Affinity DataKi:  0.200nM. Assay description: Antagonist activity at recombinant human adenosine A2A receptor expressed in HEK293 cells measured by cAMP functional assay
In DepthDetails PubMed
TargetAdenosine receptor A2a(Homo sapiens (Human))
Advinus Therapeutics
Curated by ChEMBL
LigandPNGBDBM50235055(CHEMBL4095355)
Affinity DataKi:  2.10nM. Assay description: Binding affinity to human adenosine A2A receptor expressed in HEK293 cells measured by radioligand based assay
In DepthDetails PubMed
TargetAdenosine receptor A2a(Homo sapiens (Human))
Advinus Therapeutics
Curated by ChEMBL
LigandPNGBDBM50235055(CHEMBL4095355)
Affinity DataKi:  2.10nM. Assay description: Affinity of the Compound for Dopamine D1 receptor in rat striatal membrane was determined in vitro using Dopamine Antagonist [3H]SCH-23390 as ligand.
In DepthDetails ArticlePubMed
TargetAdenosine receptor A2b(Homo sapiens (Human))
Advinus Therapeutics
Curated by ChEMBL
LigandPNGBDBM50235055(CHEMBL4095355)
Affinity DataKi:  500nM. Assay description: Compound was evaluated for its binding affinity against HIV-1 protease
In DepthDetails ArticlePubMed
TargetAdenosine receptor A2b(Homo sapiens (Human))
Advinus Therapeutics
Curated by ChEMBL
LigandPNGBDBM50235055(CHEMBL4095355)
Affinity DataKi:  650nM. Assay description: Antagonist activity at human adenosine A2B receptor expressed in HEK293 cell membranes assessed as decrease in NECA/forskolin-induced cAMP level pret...
In DepthDetails ArticlePubMed
TargetAdenosine receptor A1(Homo sapiens (Human))
Advinus Therapeutics
Curated by ChEMBL
LigandPNGBDBM50235055(CHEMBL4095355)
Affinity DataKi:  1.20E+3nM. Assay description: Displacement of [3H]-DPCPX from human adenosine A1 receptor expressed in HEK293 cell membranes measured after 90 mins
In DepthDetails ArticlePubMed