BDBM50235939 CHEMBL4102462
SMILES CC(C)OC(=O)C1=C(C)NC(C)=C(C1c1cccc2c1oc(C)cc2=O)C(C)=O
InChI Key InChIKey=ZCFHOWPYJCIUIY-UHFFFAOYSA-N
Data  1 IC50
  Tab Delimited (TSV)   2D SDfile   Computed 3D by Vconf -m prep SDfile
Find this compound or compounds like it in BindingDB:
Activity Spreadsheet -- Enzyme Inhibition Constant Data from BindingDB
Found 1 hit for monomerid = 50235939
TargetMineralocorticoid receptor(Homo sapiens (Human))
Instituto De Qu£Mica M£Dica (Iqm-Csic)
Curated by ChEMBL
LigandPNGBDBM50235939(CHEMBL4102462)
Affinity DataIC50:  39nM. Assay description: Antagonist activity at Gal4-fused human MR LBD (734 to 985 residues) expressed in CHO-K1 cells after 5 to 6 hrs by luciferase reporter gene assay
In DepthDetails ArticlePubMed