BDBM50235943 CHEMBL4099077
SMILES CC(C)OC(=O)C1=C(C)NC(C)=C(C#N)C1c1cccc2C(=O)c3ccccc3-c12
InChI Key InChIKey=YRCCQBDFMJYFKI-UHFFFAOYSA-N
Data  1 IC50
  Tab Delimited (TSV)   2D SDfile   Computed 3D by Vconf -m prep SDfile
Find this compound or compounds like it in BindingDB:
Activity Spreadsheet -- Enzyme Inhibition Constant Data from BindingDB
Found 1 hit for monomerid = 50235943
TargetMineralocorticoid receptor(Homo sapiens (Human))
Instituto De Qu£Mica M£Dica (Iqm-Csic)
Curated by ChEMBL
LigandPNGBDBM50235943(CHEMBL4099077)
Affinity DataIC50:  23nM. Assay description: Antagonist activity at Gal4-fused human MR LBD (734 to 985 residues) expressed in CHO-K1 cells after 5 to 6 hrs by luciferase reporter gene assay
In DepthDetails ArticlePubMed