BDBM50235944 CHEMBL4078631
SMILES C[C@H](O)[C@@H](C)n1cc(C(=O)Nc2ccc(cc2)S(C)(=O)=O)c(C)c1-c1ccc(F)cc1C(F)(F)F
InChI Key InChIKey=RKOXRANVRDCFQL-CABCVRRESA-N
Data  2 IC50
  Tab Delimited (TSV)   2D SDfile   Computed 3D by Vconf -m prep SDfile
Find this compound or compounds like it in BindingDB:
Activity Spreadsheet -- Enzyme Inhibition Constant Data from BindingDB
Found 2 hits for monomerid = 50235944
TargetMineralocorticoid receptor(Homo sapiens (Human))
Instituto De Qu£Mica M£Dica (Iqm-Csic)
Curated by ChEMBL
LigandPNGBDBM50235944(CHEMBL4078631)
Affinity DataIC50:  3.80nM. Assay description: Compound was tested in vitro for inhibition of tubulin polymerization.
In DepthDetails ArticlePubMed
TargetMineralocorticoid receptor(Homo sapiens (Human))
Instituto De Qu£Mica M£Dica (Iqm-Csic)
Curated by ChEMBL
LigandPNGBDBM50235944(CHEMBL4078631)
Affinity DataIC50: >1.00E+3nM. Assay description: Antagonist activity at Gal4-fused human MR LBD (671 to 984 residues) expressed in African Green Monkey CV-1 cells assessed as inhibition of aldostero...
In DepthDetails ArticlePubMed