BDBM50235957 CHEMBL4075462
SMILES COc1ccccc1CCc1cccc(NC(N)=O)n1
InChI Key InChIKey=HMYNLGJLDUENAQ-UHFFFAOYSA-N
Data  2 IC50
  Tab Delimited (TSV)   2D SDfile   Computed 3D by Vconf -m prep SDfile
Find this compound or compounds like it in BindingDB:
Activity Spreadsheet -- Enzyme Inhibition Constant Data from BindingDB
Found 2 hits for monomerid = 50235957
TargetMineralocorticoid receptor(Homo sapiens (Human))
Instituto De Qu£Mica M£Dica (Iqm-Csic)
Curated by ChEMBL
LigandPNGBDBM50235957(CHEMBL4075462)
Affinity DataIC50:  97nM. Assay description: Antagonist activity at Gal4-fused human MR LBD expressed in HEK293T cells assessed as inhibition of aldosterone-induced transactivation activity afte...
In DepthDetails ArticlePubMed
TargetMineralocorticoid receptor(Homo sapiens (Human))
Instituto De Qu£Mica M£Dica (Iqm-Csic)
Curated by ChEMBL
LigandPNGBDBM50235957(CHEMBL4075462)
Affinity DataIC50:  25nM. Assay description: Displacement of TAMRA-labeled dexamethasone from full-length human mineralocorticoid receptor expressed in baculovirus infected insect cells after 60...
In DepthDetails ArticlePubMed