BDBM50235967 CHEMBL4063566
SMILES C[C@@H]1CN([C@@H](CO1)c1cccc(F)c1)c1ccc2OCC(=O)Nc2c1
InChI Key InChIKey=CEEUUCMHBFYGQS-PXAZEXFGSA-N
Data  1 IC50
  Tab Delimited (TSV)   2D SDfile   Computed 3D by Vconf -m prep SDfile
Find this compound or compounds like it in BindingDB:
Activity Spreadsheet -- Enzyme Inhibition Constant Data from BindingDB
Found 1 hit for monomerid = 50235967
TargetMineralocorticoid receptor(Homo sapiens (Human))
Instituto De Qu£Mica M£Dica (Iqm-Csic)
Curated by ChEMBL
LigandPNGBDBM50235967(CHEMBL4063566)
Affinity DataIC50:  55nM. Assay description: Antagonist activity at Gal4-fused MR LBD (unknown origin) expressed in human Huh7 cells assessed as inhibition of aldosterone-induced transcriptional...
In DepthDetails ArticlePubMed