BDBM50236331 CHEMBL4091498
SMILES NC(=O)c1cccc(c1)-c1ccc(OC(=O)NCCCN2CCN(CC2)c2cccc(Cl)c2Cl)cc1
InChI Key InChIKey=QIVWZHLPLMDRRN-UHFFFAOYSA-N
Data  1 IC50  4 EC50
  Tab Delimited (TSV)   2D SDfile   Computed 3D by Vconf -m prep SDfile
Find this compound or compounds like it in BindingDB:
Activity Spreadsheet -- Enzyme Inhibition Constant Data from BindingDB
Found 5 hits for monomerid = 50236331
TargetD(3) dopamine receptor(Homo sapiens (Human))
Universit£
Curated by ChEMBL
LigandPNGBDBM50236331(CHEMBL4091498)
Affinity DataEC50:  6.10nM. Assay description: Inhibitory concentration against Farnesyltransferase for Farnesylation of H-ras protein InNIH 3T3 cells transformed with activated H-ras
In DepthDetails ArticlePubMed
TargetD(3) dopamine receptor(Homo sapiens (Human))
Universit£
Curated by ChEMBL
LigandPNGBDBM50236331(CHEMBL4091498)
Affinity DataEC50:  6.20nM. Assay description: Agonist activity at recombinant human CB1 receptor expressed in CHO-K1 cells assessed as increase in cAMP accumulation after 20 mins by HTRF assay
In DepthDetails ArticlePubMed
TargetFatty-acid amide hydrolase 1(Homo sapiens (Human))
Universit£
Curated by ChEMBL
LigandPNGBDBM50236331(CHEMBL4091498)
Affinity DataIC50:  0.5nM. Assay description: Inhibition of human FAAH1 expressed in HEK293 cell membrane-enriched lysate using AMC arachidonyl amide as substrate preincubated for 50 mins followe...
In DepthDetails ArticlePubMed
TargetD(3) dopamine receptor(Homo sapiens (Human))
Universit£
Curated by ChEMBL
LigandPNGBDBM50236331(CHEMBL4091498)
Affinity DataEC50:  0.900nM. Assay description: Agonist activity at recombinant human dopamine D3 receptor expressed in CHO-K1 cells assessed as increase in cAMP accumulation after 30 mins by HTRF ...
In DepthDetails ArticlePubMed
TargetD(2) dopamine receptor(Homo sapiens (Human))
Universit£
Curated by ChEMBL
LigandPNGBDBM50236331(CHEMBL4091498)
Affinity DataEC50:  40nM. Assay description: Agonist activity at human dopamine D2 receptor-short expressed in CHO-K1 cells assessed as reduction in adenylyl cyclase activator NKH 477 induced cA...
In DepthDetails ArticlePubMed