BDBM50236854 CHEMBL4074173
SMILES Cc1coc-2c1C(=O)C(=O)c1c(C)ccc(C)c-21
InChI Key InChIKey=RGZIGPMJBPTDBT-UHFFFAOYSA-N
Data  2 IC50
  Tab Delimited (TSV)   2D SDfile   Computed 3D by Vconf -m prep SDfile
Find this compound or compounds like it in BindingDB:
Activity Spreadsheet -- Enzyme Inhibition Constant Data from BindingDB
Found 2 hits for monomerid = 50236854
TargetNAD(P)H dehydrogenase [quinone] 1(Homo sapiens (Human))
China Pharmaceutical University
Curated by ChEMBL
LigandPNGBDBM50236854(CHEMBL4074173)
Affinity DataIC50:  2.90E+3nM. Assay description: Functional potency measured as intracellular calcium elevation in Hek-293 cells expressing hGHSR1a
In DepthDetails ArticlePubMed
TargetNADPH--cytochrome P450 reductase(Homo sapiens (Human))
China Pharmaceutical University
Curated by ChEMBL
LigandPNGBDBM50236854(CHEMBL4074173)
Affinity DataIC50:  1.70E+4nM. Assay description: Inhibitory concentration required for antagonistic activity at Metabotropic glutamate receptor 2
In DepthDetails ArticlePubMed