BDBM50237017 CHEMBL4083827
SMILES Fc1cnc(nc1N(Cc1ccc2OCOc2c1)c1cccc(OCc2ccccc2)c1)C#N
InChI Key InChIKey=ULHFTHRCYNGFEK-UHFFFAOYSA-N
Data  1 KI
  Tab Delimited (TSV)   2D SDfile   Computed 3D by Vconf -m prep SDfile
Find this compound or compounds like it in BindingDB:
Activity Spreadsheet -- Enzyme Inhibition Constant Data from BindingDB
Found 1 hit for monomerid = 50237017
TargetProcathepsin L(Homo sapiens (Human))
Roche Pharmaceutical Research And Early Development (Pred)
Curated by ChEMBL
LigandPNGBDBM50237017(CHEMBL4083827)
Affinity DataKi: >5.10E+3nM. Assay description: Inhibition of human Cathepsin L by fluorescence assay based Cheng-Prusoff equation analysis
In DepthDetails ArticlePubMed