BDBM50237021 CHEMBL4069851
SMILES Fc1cnc(nc1N(CC1CC1)Cc1ccc2OCOc2c1)C#N
InChI Key InChIKey=GLWKFUQNDIJFBU-UHFFFAOYSA-N
Data  1 KI
  Tab Delimited (TSV)   2D SDfile   Computed 3D by Vconf -m prep SDfile
Find this compound or compounds like it in BindingDB:
Activity Spreadsheet -- Enzyme Inhibition Constant Data from BindingDB
Found 1 hit for monomerid = 50237021
TargetProcathepsin L(Homo sapiens (Human))
Roche Pharmaceutical Research And Early Development (Pred)
Curated by ChEMBL
LigandPNGBDBM50237021(CHEMBL4069851)
Affinity DataKi:  77nM. Assay description: Binding affinity for dopamine D4-like receptor labelled with [3H]YM-09151-2 in retina
In DepthDetails ArticlePubMed